{"text_format":"1","workbook":"xlsx","n_sheets":6,"sheets":["Instructions","Subtotal Formats","Lookups","Crayons","Color Families","Color Wheel"],"not_rendered":{"charts":0,"images":13,"macros":1,"external_links":0,"defined_names":32,"comments":0,"pivot_tables":0},"unopened":[],"bounds":{"document_bytes":16777216,"sheet_cells":100000,"rows_first":2000,"rows_last":500,"rows_between":2000,"halvings":0,"cell_chars":16384,"cell_head_chars":4096},"cells_cut":0,"cells_raw":0,"read":"whole","date_system":"1900"}

{"sheet":"Instructions","index":0,"n_rows":115,"n_cols":8,"rows_kept":115,"cut":false,"hidden":false,"merged":[[52,1,52,6],[53,1,53,6],[52,7,52,16],[53,7,53,16],[45,7,45,16],[47,1,47,6],[47,7,47,16],[48,7,48,16],[49,7,49,16],[50,7,50,16],[51,7,51,16],[48,1,48,6],[49,1,49,6],[50,1,50,6],[51,1,51,6],[44,7,44,16],[43,7,43,16],[44,1,44,6],[45,1,45,6],[46,1,46,6],[46,7,46,16],[43,1,43,6]]}
["Purpose of this spreadsheet"]
["The macros and calculations included in this template are provided solely for your convenience, and Sage does not make any assurances or claims regarding their accuracy. Please be aware that Sage will not offer customer support for any problems related to macros and/or calculations used in this template."]
["The purpose of this Excel spreadsheet is to facilitate the formatting of subtotal lines and grand total lines on Tables and Pivot Tables in ICRW."]
[]
["All references to \"subtotals\" in this spreadsheet are also applicable to \"grand totals\"."]
[]
["Ordinary lines of totals, without any special formatting, look like this in ICRW (subtotals by Customer)"]
[]
[]
[]
[]
[]
[]
[]
[]
[]
[]
[]
[]
[]
[]
[]
[]
["Other than the use of bold text, there isn't much visual differentiation between total rows and detail rows."]
[]
["This spreadsheet allows us to build custom subtotal formats using Cascading Style Sheet (CSS) code.  The "]
["spreadsheet creates the CSS code based on the selection of various options on the Subtotal Formats sheet."]
[]
["An example of a custom subtotal format is shown here, with ten custom formatting options noted:"]
[]
{"$rows_left_out":86}
{"sheet":"Subtotal Formats","index":1,"n_rows":51,"n_cols":16,"rows_kept":51,"cut":false,"hidden":false,"merged":[[50,0,50,1],[46,2,46,14],[46,0,46,1],[47,0,47,1],[48,0,48,1],[49,0,49,1]]}
["Subtotal Rows - Format Values",null,null,null,null,null,null,null,"Subtotal Rows - Format Labels"]
[]
["Cell Characteristics","Selections","Color","Value","Defaults","Associated Text","Legend from Instructions sheet",null,"Cell Characteristics","Selections","Color","Value","Defaults","Associated Text"]
["Upper Line Type (above values)",3,null,{"$f":"IF(LEN(INDEX(LINE_TYPES,B4,1))=0,\"None\",INDEX(LINE_TYPES,B4,1))","v":"Single"},"None",null,null,null,"Upper Line Type (above values)",3,null,{"$f":"IF(LEN(INDEX(LINE_TYPES,J4,1))=0,\"None\",INDEX(LINE_TYPES,J4,1))","v":"Single"},"None"]
["Lower Line Type (below values)",4,null,{"$f":"IF(LEN(INDEX(LINE_TYPES,B5,1))=0,\"None\",INDEX(LINE_TYPES,B5,1))","v":"Double"},"None",null,null,null,"Lower Line Type (below values)",3,null,{"$f":"IF(LEN(INDEX(LINE_TYPES,J5,1))=0,\"None\",INDEX(LINE_TYPES,J5,1))","v":"Single"},"None"]
["Background Color (behind values)",4,null,{"$f":"IF(LEN(INDEX(Color_Lookup,B6,1))=0,\"#000000\",INDEX(Color_Lookup,B6,2))","v":"#FFFFBF"},"White",{"$f":"IF(LEN(INDEX(Color_Lookup,B6,1))=0,\"Black\",INDEX(Color_Lookup,B6,3))","v":"Black"},null,null,"Background Color (behind values)",5,null,{"$f":"IF(LEN(INDEX(Color_Lookup,J6,1))=0,\"#FFFFFF\",INDEX(Color_Lookup,J6,2))","v":"#26EAEA"},"White",{"$f":"IF(LEN(INDEX(Color_Lookup,J6,1))=0,\"Black\",INDEX(Color_Lookup,J6,3))","v":"Black"}]
["Extra padding space above values",2,null,{"$f":"IF(INDEX(YES_NO,B7,1)=\"No\",0,6)&\"px\"","v":"6px"},"Yes - 6px",null,null,null,"Extra padding space above values",2,null,{"$f":"IF(INDEX(YES_NO,J7,1)=\"No\",0,6)&\"px\"","v":"6px"},"Yes - 5px"]
["Null space below lower line",2,null,{"$f":"IF(INDEX(YES_NO,B8,1)=\"No\",\"0px\",\"30px\")","v":"30px"},"Yes - 30px",null,null,null,"Null space below lower line",2,null,{"$f":"IF(INDEX(YES_NO,J8,1)=\"No\",\"0px\",\"30px\")","v":"30px"},"Yes - 30px"]
["Null space color",3,null,{"$f":"IF(LEN(INDEX(Color_Lookup,B9,1))=0,\"#000000\",INDEX(Color_Lookup,B9,2))","v":"#FFFFFF"},"White",null,null,null,"Null space color",13,null,{"$f":"IF(LEN(INDEX(Color_Lookup,J9,1))=0,\"#FFFFFF\",INDEX(Color_Lookup,J9,2))","v":"#FFB7D5"},"White"]
[]
[]
["Line Characteristics","Selections","Color","Value","Defaults",null,null," ","Line Characteristics","Selections","Color","Value","Defaults",null,null," "]
["Line Color (All lines)",2,null,{"$f":"IF(LEN(INDEX(Color_Lookup,B13,1))=0,\"#000000\",INDEX(Color_Lookup,B13,2))","v":"#000000"},"Black",null,null,null,"Line Color",8,null,{"$f":"IF(LEN(INDEX(Color_Lookup,J13,1))=0,\"#000000\",INDEX(Color_Lookup,J13,2))","v":"#003AF6"},"Black"]
["Line Thickness  (All lines)",3,null,{"$f":"IF(LEN(INDEX(LINE_THICKNESS,B14,1))=0,\"1px\",INDEX(LINE_THICKNESS,B14,1))","v":"2px"},"1px",null,null,null,"Line Thickness",3,null,{"$f":"IF(LEN(INDEX(LINE_THICKNESS,J14,1))=0,\"1px\",INDEX(LINE_THICKNESS,J14,1))","v":"2px"},"1px"]
["Vertical space between double lines",4,null,{"$f":"IF(LEN(INDEX(LINE_THICKNESS,B15,1))=0,\"3px\",INDEX(LINE_THICKNESS,B15,1))","v":"3px"},"3px",null,null,null,"Vertical space between double lines",4,null,{"$f":"IF(LEN(INDEX(LINE_THICKNESS,J15,1))=0,\"3px\",INDEX(LINE_THICKNESS,J15,1))","v":"3px"},"3px"]
[]
[]
[]
[]
["CSS Output",null,null,null,null,null,null," ","CSS Output"]
["Copy/Paste this string into the Custom CSS Style field on the Edit Format dialog",null,null,null,null,null,null,null,"Copy/Paste this string into the Custom CSS Style field on the Edit Format dialog"]
[{"$f":"F38&\"background-image: linear-gradient(180deg, \"&_xlfn.CONCAT(G29:G40)","v":"background-image: linear-gradient(180deg, #000000 0px, #000000 2px, #FFFFBF 2px, #FFFFBF 2px, #000000 2px, #000000 2px, #FFFFBF 2px, #FFFFBF 51.0%, #000000 51.0%, #000000 calc(51.0% + 2px), #FFFFBF calc(51.0% + 2px), #FFFFBF calc(51.0% + 5px), #000000 calc(51.0% + 5px), #000000 calc(51.0% + 7px), #FFFFFF calc(51.0% + 7px), #FFFFFF 100.0%);padding-bottom: 30px; padding-top: 8px; color: Black; "},null,null,null,null,null,null," ",{"$f":"N38&\"background-image: linear-gradient(180deg, \"&_xlfn.CONCAT(O29:O40)","v":"background-image: linear-gradient(180deg, #003AF6 0px, #003AF6 2px, #26EAEA 2px, #26EAEA 2px, #003AF6 2px, #003AF6 2px, #26EAEA 2px, #26EAEA 51.0%, #003AF6 51.0%, #003AF6 calc(51.0% + 2px), #26EAEA calc(51.0% + 2px), #26EAEA calc(51.0% + 2px), #003AF6 calc(51.0% + 2px), #003AF6 calc(51.0% + 2px), #FFB7D5 calc(51.0% + 2px), #FFB7D5 100.0%);padding-bottom: 30px; padding-top: 8px; color: Black; "}]
[]
[]
[]
["CSS Generator for Values (Reference only; do not modify)",null,null,null,null,null,null,null,"CSS Generator for Labels (Reference only; do not modify)"]
[]
["Formatting Feature","Color","Hex","Height\n(px or %)","Start","Stop","CSS Component",null,"Formatting Feature","Color","Hex","Height\n(px or %)","Start","Stop","CSS Component"]
["Upper Line #1",{"$f":"_xlfn.XLOOKUP(D$13,Lookups!$C$4:$C$17,Lookups!$B$4:$B$17)","v":"Black"},{"$f":"+D$13&\" \"","v":"#000000 "},{"$f":"VALUE(IF(D4=\"None\",0,SUBSTITUTE(D14,\"px\",\"\")))","v":2},"0px, ",{"$f":"SUM(D$29:D29)&\"px\"","v":"2px"},{"$f":"IF(B29=\"None\",\"\",C29&E29&C29&F29&\", \")","v":"#000000 0px, #000000 2px, "},null,"Upper Line #1",{"$f":"_xlfn.XLOOKUP(L$13,Lookups!$C$4:$C$17,Lookups!$B$4:$B$17)","v":"Vivid Blue"},{"$f":"+L$13&\" \"","v":"#003AF6 "},{"$f":"VALUE(IF(L4=\"None\",0,SUBSTITUTE(L14,\"px\",\"\")))","v":2},"0px, ",{"$f":"SUM(L$29:L29)&\"px\"","v":"2px"},{"$f":"IF(J29=\"None\",\"\",K29&M29&K29&N29&\", \")","v":"#003AF6 0px, #003AF6 2px, "}]
["Space between double upper lines",{"$f":"_xlfn.XLOOKUP(D$6,Lookups!$C$4:$C$17,Lookups!$B$4:$B$17)","v":"Light Yellow"},{"$f":"+D$6&\" \"","v":"#FFFFBF "},{"$f":"VALUE(IF(D4<>\"Double\",0,SUBSTITUTE(D15,\"px\",\"\")))","v":0},{"$f":"+F29&\", \"","v":"2px, "},{"$f":"SUM(D$29:D30)&\"px\"","v":"2px"},{"$f":"IF(B30=\"None\",\"\",C30&E30&C30&F30&\", \")","v":"#FFFFBF 2px, #FFFFBF 2px, "},null,"Space between double upper lines",{"$f":"_xlfn.XLOOKUP(L$6,Lookups!$C$4:$C$17,Lookups!$B$4:$B$17)","v":"Bright Turq"},{"$f":"+L$6&\" \"","v":"#26EAEA "},{"$f":"VALUE(IF(L4<>\"Double\",0,SUBSTITUTE(L15,\"px\",\"\")))","v":0},{"$f":"+N29&\", \"","v":"2px, "},{"$f":"SUM(L$29:L30)&\"px\"","v":"2px"},{"$f":"IF(J30=\"None\",\"\",K30&M30&K30&N30&\", \")","v":"#26EAEA 2px, #26EAEA 2px, "}]
{"$rows_left_out":22}
{"sheet":"Lookups","index":2,"n_rows":41,"n_cols":6,"rows_kept":41,"cut":false,"hidden":false,"merged":[[1,1,1,2],[1,3,1,4]]}
[null,"Range name: COLOR_LOOKUP"]
[null,"Background Colors",null,"Associated Text Color",null,{"$f":"+\"Manage your list of selectable colors by adding or deleting lines between rows \"&ROW(C4)&\" and \"&ROW(C17)&\" below.\"","v":"Manage your list of selectable colors by adding or deleting lines between rows 4 and 17 below."}]
[null,"Color Names","Hex Code","Color Name","Hex Code","Samples of Hex Color Codes can be found on several other tabs of this spreadsheet."]
[]
[null,"Black","#000000","White","#FFFFFF"]
[null,"White","#FFFFFF","Black","#000000"]
[null,"Light Yellow","#FFFFBF","Black","#000000"]
[null,"Bright Turq","#26EAEA","Black","#000000"]
[null,"Pink","#FF8CC6","Black","#000000"]
[null,"Paris Green","#4AC286","Black","#000000"]
[null,"Vivid Blue","#003AF6","White","#FFFFFF"]
[null,"Navy Blue","#002086","White","#FFFFFF"]
[null,"Red","#FF0000","White","#FFFFFF"]
[null,"Hudson Blue","#95C0E7","Black","#000000"]
[null,"Melon","#FEBAAD","Black","#000000"]
[null,"Cotton Candy","#FFB7D5","Black","#000000"]
[]
[]
[]
[null,"Range name: LINE_TYPES"]
[]
[null,"None"]
[null,"Single"]
[null,"Double"]
[]
[]
[]
[null,"Range name: LINE_THICKNESS",null,null,{"$f":"+\"For more line thicknesses, insert additional lines between lines \"&\"lines \"&ROW(B29)&\" and \"&ROW(B35)&\", as desired.\"","v":"For more line thicknesses, insert additional lines between lines lines 29 and 35, as desired."}]
[]
[null,"1px"]
{"$rows_left_out":12}
{"sheet":"Crayons","index":3,"n_rows":277,"n_cols":9,"rows_kept":277,"cut":false,"hidden":false,"merged":[]}
["Crayola ® Crayon Colors"]
[]
["For more cool information, see:"]
["https://en.wikipedia.org/wiki/List_of_Crayola_crayon_colors"]
[]
["Standard Colors - Current box of 64",null,null,null,null,"Standard Colors - Other"]
[]
["Color Name","Hex Color","Recommended\nText Color",null,null,"Color Name","Hex Color","Recommended\nText Color","Years in\nProduction"]
["Red","#ED0A3F","White",null,null,"Maroon","#C32148","White","1949–present"]
["Scarlet","#FD0E35","White",null,null,"English Vermilion","#CC474B","White","1903–1935"]
["Brick Red","#C62D42","White",null,null,"Madder Lake","#CC3336","White","1903–1935"]
["Chestnut","#B94E48","White",null,null,"Permanent Geranium Lake","#E12C2C","White","1903–circa 1910"]
["Bittersweet","#FE6F5E","White",null,null,"Maximum Red","#D92121","White","1926–1944"]
["Burnt Orange","#CC5500","White",null,null,"Orange-Red","#FF5349","White","1958–1990"]
["Red-Orange","#FF681F","White",null,null,"Sunset Orange","#FE4C40","White","1997–present"]
["Orange","#FF8833","Black",null,null,"Dark Venetian Red","#B33B24","White","1903–circa 1910"]
["Macaroni and Cheese","#FFB97B","Black",null,null,"Venetian Red","#CC553D","White","1903–1944"]
["Yellow-Orange","#FFAE42","Black",null,null,"Light Venetian Red","#E6735C","White","1903–circa 1910"]
["Goldenrod","#FCD667","Black",null,null,"Vivid Tangerine","#FF9980","Black","1990–present"]
["Dandelion","#FED85D","Black",null,null,"Mango Tango","#E77200","White","2003–present"]
["Yellow","#FBE870","Black",null,null,"Banana Mania","#FBE7B2","Black","1998–present"]
["Green-Yellow","#BDE861","Black",null,null,"Maize","#F2C649","Black","1903–1990"]
["Olive Green","#808000","White",null,null,"Orange-Yellow","#F8D568","Black","1958–1990"]
["Spring Green","#ECEBBD","Black",null,null,"Middle Yellow","#FFD600","Black","1926–1944"]
["Yellow-Green","#C5E17A","Black",null,null,"Maximum Yellow","#FAFA37","Black","1926–1944"]
["Asparagus","#7BA05B","White",null,null,"Canary","#FFFF99","Black","1998–present"]
["Granny Smith Apple","#9DE093","Black",null,null,"Lemon Yellow","#FFFF9F","Black","1903–1990"]
["Green","#01A638","White",null,null,"Inchworm","#AFE313","Black","2003–present"]
["Forest Green","#5FA777","White",null,null,"Fern","#63B76C","White","1998–present"]
["Sea Green","#93DFB8","Black",null,null,"Shamrock","#33CC99","Black","1993–present"]
{"$rows_left_out":248}
{"sheet":"Color Families","index":4,"n_rows":44,"n_cols":26,"rows_kept":44,"cut":false,"hidden":false,"merged":[[1,3,1,7],[1,9,1,13]]}
[]
[null,null,null,"Blue",null,null,null,null,null,"Green",null,null,null,null,null,"Yellow/Gold",null,"Orange/Brown",null,"Red",null,"Magenta",null,"Purple",null,"Violet"]
[]
[null,"100% ",null," #FFFFFF",null," #FFFFFF",null," #FFFFFF",null," #FFFFFF",null," #FFFFFF",null," #FFFFFF",null," #FFFFFF",null," #FFFFFF",null," #FFFFFF",null," #FFFFFF",null," #FFFFFF",null," #FFFFFF"]
[]
[null,"95% ",null," #E6EBFF",null," #E6F5FF",null," #E6FFFF",null," #ECF9F2",null," #EBFAEB",null," #EEFFE6",null," #FFFFE6",null," #FFF0E6",null," #FFE6E6",null," #FFE6F2",null," #F9E6FF",null," #F2E6FF"]
[]
[null,"90% ",null," #CCD8FF",null," #CCEBFF",null," #CCFFFF",null," #D9F2E6",null," #D6F5D6",null," #DDFFCC",null," #FFFFCC",null," #FFE0CC",null," #FFCCCC",null," #FFCCE6",null," #F3CCFF",null," #E6CCFF"]
[]
[null,"85% ",null," #B3C4FF",null," #B3E0FF",null," #B3FFFF",null," #C6ECD9",null," #C2F0C2",null," #CCFFB3",null," #FFFFB3",null," #FFD1B3",null," #FFB3B3",null," #FFB3D9",null," #EDB3FF",null," #D9B3FF"]
[]
[null,"80% ",null," #99B1FF",null," #99D6FF",null," #99FFFF",null," #B3E6CC",null," #ADEBAD",null," #BBFF99",null," #FFFF99",null," #FFC299",null," #FF9999",null," #FF99CC",null," #E799FF",null," #CC99FF"]
[]
[null,"75% ",null," #809DFF",null," #80CCFF",null," #80FFFF",null," #9FDFBF",null," #99E699",null," #AAFF80",null," #FFFF80",null," #FFB380",null," #FF8080",null," #FF80BF",null," #E180FF",null," #BF80FF"]
[]
[null,"70% ",null," #668AFF",null," #66C2FF",null," #66FFFF",null," #8CD9B3",null," #85E085",null," #99FF66",null," #FFFF66",null," #FFA366",null," #FF6666",null," #FF66B3",null," #DB66FF",null," #B366FF"]
[]
[null,"65% ",null," #4D76FF",null," #4DB8FF",null," #4DFFFF",null," #79D2A6",null," #70DB70",null," #88FF4D",null," #FFFF4D",null," #FF944D",null," #FF4D4D",null," #FF4DA6",null," #D54DFF",null," #A64DFF"]
[]
[null,"60% ",null," #3363FF",null," #33ADFF",null," #33FFFF",null," #66CC99",null," #5CD65C",null," #77FF33",null," #FFFF33",null," #FF8533",null," #FF3333",null," #FF3399",null," #CF33FF",null," #9933FF"]
[]
[null,"55% ",null," #1A4FFF",null," #1AA3FF",null," #1AFFFF",null," #53C68C",null," #47D147",null," #66FF1A",null," #FFFF1A",null," #FF751A",null," #FF1A1A",null," #FF1A8C",null," #C91AFF",null," #8C1AFF"]
[]
[null,"50% ",null," #003CFF",null," #0099FF",null," #00FFFF",null," #40BF80",null," #33CC33",null," #55FF00",null," #FFFF00",null," #FF6600",null," #FF0000",null," #FF0080",null," #C300FF",null," #8000FF"]
[]
[null,"45% ",null," #0036E6",null," #008AE6",null," #00E6E6",null," #39AC73",null," #2EB82E",null," #4CE600",null," #E6E600",null," #E65C00",null," #E60000",null," #E60073",null," #9900e6",null," #7300E6"]
[]
[null,"40% ",null," #0030CC",null," #007ACC",null," #00CCCC",null," #339966",null," #29A329",null," #44CC00",null," #CCCC00",null," #CC5200",null," #CC0000",null," #CC0066",null," #9C00CC",null," #6600CC"]
[]
[null,"35% ",null," #002AB3",null," #006BB3",null," #00B3B3",null," #2D8659",null," #248F24",null," #3BB300",null," #B3B300",null," #B34700",null," #B30000",null," #B30059",null," #8900B3",null," #5900B3"]
{"$rows_left_out":15}
{"sheet":"Color Wheel","index":5,"n_rows":10,"n_cols":36,"rows_kept":10,"cut":false,"hidden":false,"merged":[[8,31,8,32],[8,33,8,34],[9,8,9,9],[9,12,9,13],[9,14,9,15],[9,16,9,17],[9,18,9,19],[9,20,9,21],[9,32,9,33],[8,19,8,20],[8,21,8,22],[8,23,8,24],[8,25,8,26],[8,27,8,28],[8,29,8,30],[8,5,8,6],[8,7,8,8],[8,9,8,10],[8,11,8,12],[8,13,8,14],[8,15,8,16],[8,17,8,18],[7,18,7,19],[7,20,7,21],[6,31,6,32],[6,33,6,34],[6,35,6,36],[7,4,7,5],[7,6,7,7],[7,8,7,9],[7,10,7,11],[7,12,7,13],[7,14,7,15],[7,16,7,17],[6,19,6,20],[6,21,6,22],[6,23,6,24],[6,25,6,26],[6,27,6,28],[6,29,6,30],[7,30,7,31],[7,32,7,33],[7,34,7,35],[7,22,7,23],[7,24,7,25],[7,26,7,27],[7,28,7,29],[6,3,6,4],[6,5,6,6],[6,7,6,8],[6,9,6,10],[6,11,6,12],[6,13,6,14],[6,15,6,16],[6,17,6,18],[5,18,5,19],[4,29,4,30],[4,7,4,8],[4,9,4,10],[4,11,4,12],[4,13,4,14],[4,15,4,16],[4,31,4,32],[5,2,5,3],[5,4,5,5],[5,6,5,7],[5,8,5,9],[5,10,5,11],[5,12,5,13],[5,14,5,15],[5,16,5,17],[4,17,4,18],[4,19,4,20],[4,21,4,22],[4,23,4,24],[4,25,4,26],[4,27,4,28],[5,30,5,31],[5,32,5,33],[5,20,5,21],[5,22,5,23],[5,24,5,25],[5,26,5,27],[5,28,5,29],[4,3,4,4],[4,5,4,6],[3,14,3,15],[3,16,3,17],[2,23,2,24],[2,25,2,26],[2,27,2,28],[2,29,2,30],[3,4,3,5],[3,6,3,7],[3,8,3,9],[3,10,3,11],[3,12,3,13],[3,26,3,27],[3,28,3,29],[3,30,3,31],[3,18,3,19],[3,20,3,21],[3,22,3,23],[3,24,3,25],[1,18,1,19],[1,20,1,21],[2,5,2,6],[2,7,2,8],[2,9,2,10],[2,11,2,12],[2,13,2,14],[2,15,2,16],[2,17,2,18],[2,19,2,20],[1,6,1,7],[1,8,1,9],[1,10,1,11],[1,12,1,13],[1,14,1,15],[1,16,1,17],[2,21,2,22]]}
[]
[null,null,null,null,null,null,"66CCCC",null,"99CCCC",null,"CCCCCC",null,"000000",null,"000066",null,"000099",null,"0000CC",null,"0000FF"]
[null,null,null,null,null,"6699CC",null,"9999CC",null,"CC99CC",null,"660000",null,"660066",null,"660099",null,"6600CC",null,"6600FF",null,"0066FF",null,"0066CC",null,"006699",null,"006666",null,"006600"]
[null,null,null,null,"6666CC",null,"9966CC",null,"CC66CC",null,"990000",null,"990066",null,"990099",null,"9900CC",null,"9900FF",null,"6666FF",null,"0099FF",null,"0099CC",null,"009999",null,"009966",null,"009900"]
[null,null,null,666699,null,"996699",null,"CC6699",null,"CC0000",null,"CC0066",null,"CC0099",null,"CC00CC",null,"CC00FF",null,"9966FF",null,"6699FF",null,"00CCFF",null,"00CCCC",null,"00CC99",null,"00CC66",null,"00CC00"]
[null,null,666666,null,"996666",null,"CC6666",null,"FF0000",null,"FF0066",null,"FF0099",null,"FF00CC",null,"FF00FF",null,"CC66FF",null,"9999FF",null,"66CCFF",null,"00FFFF",null,"00FFCC",null,"00FF99",null,"00FF66",null,"00FF00"]
[null,null,null,"666600",null,"996600",null,"CC6600",null,"FF6600",null,"FF6666",null,"FF6699",null,"FF66CC",null,"FF66FF",null,"CC99FF",null,"99CCFF",null,"66FFFF",null,"66FFCC",null,"66FF99",null,"66FF66",null,"66FF00",null,"66CC66",null,"66CC99"]
[null,null,null,null,"669900",null,"CC9966",null,"CC9900",null,"FF9900",null,"FF9966",null,"FF9999",null,"FF99CC",null,"FF99FF",null,"CCCCFF",null,"99FFFF",null,"99FFCC",null,"99FF99",null,"99FF66",null,"99FF00",null,"99CC66",null,"999966"]
[null,null,null,null,null,"66CC00",null,"99CC00",null,"CCCC00",null,"FFCC00",null,"FFCC66",null,"FFCC99",null,"FFCCCC",null,"FFCCFF",null,"CCFFFF",null,"CCFFCC",null,"CCFF99",null,"CCFF66",null,"CCFF00",null,"CCCC66",null,"99CC99"]
[null,null,null,null,null,null,null,null,"999900",null,null,null,"FFFF00",null,"FFFF66",null,"FFFF99",null,"FFFFCC",null,"FFFFFF",null,null,null,null,null,null,null,null,null,null,null,"CCCC99"]